Reaction Details
TargetMetabotropic glutamate receptor 6
LigandBDBM50089897
Substrate/Competitorn/a
Meas. Tech.ChEMBL_104311 (CHEMBL718130)
Ki 2400±n/a nM
Citation Bräuner-Osborne, HEgebjerg, JNielsen, EOMadsen, UKrogsgaard-Larsen, P Ligands for glutamate receptors: design and therapeutic prospects. J Med Chem43:2609-45 (2000) Metabotropic glutamate receptor 6
Name:Metabotropic glutamate receptor 6
Type:Enzyme Catalytic Domain
Mol. Mass.:95479.26
Organism:Homo sapiens (Human)
Description:metabotropic glutamate 6 GRM6 HUMAN::O15303
Residue:877
BDBM50089897
NameBDBM50089897
Synonyms:4-Amino-2-thia-bicyclo[3.1.0]hexane-4,6-dicarboxylic acid(LY389795) | CHEMBL88999
TypeSmall organic molecule
Emp. Form.C7H9NO4S
Mol. Mass.203.216
SMILESN[C@]1(CSC2[C@@H](C12)C(O)=O)C(O)=O