Reaction Details
TargetMetabotropic glutamate receptor 8
LigandBDBM66976
Substrate/Competitorn/a
Meas. Tech.ChEMBL_104492 (CHEMBL712473)
Ki 45000±n/a nM
Citation Bräuner-Osborne, HEgebjerg, JNielsen, EOMadsen, UKrogsgaard-Larsen, P Ligands for glutamate receptors: design and therapeutic prospects. J Med Chem43:2609-45 (2000) Metabotropic glutamate receptor 8
Name:Metabotropic glutamate receptor 8
Type:Enzyme Catalytic Domain
Mol. Mass.:101759.58
Organism:Homo sapiens (Human)
Description:metabotropic glutamate 8 GRM8 HUMAN::O00222
Residue:908
BDBM66976
NameBDBM66976
Synonyms:(1S,3R)-1-aminocyclopentane-1,3-dicarboxylic acid;hydrate CHEMBL34453 SMR001230688 trans-( )-ACPD monohydrate
TypeSmall organic molecule
Emp. Form.C7H11NO4
Mol. Mass.173.1665
SMILESN[C@]1(CC[C@H](C1)C(O)=O)C(O)=O