Reaction Details
TargetMetabotropic glutamate receptor 7
LigandBDBM50084137
Substrate/Competitorn/a
Meas. Tech.ChEMBL_104479 (CHEMBL712461)
Ki>100000±n/a nM
Citation Bräuner-Osborne, HEgebjerg, JNielsen, EOMadsen, UKrogsgaard-Larsen, P Ligands for glutamate receptors: design and therapeutic prospects. J Med Chem43:2609-45 (2000) Metabotropic glutamate receptor 7
Name:Metabotropic glutamate receptor 7
Type:Enzyme Catalytic Domain
Mol. Mass.:102262.98
Organism:Homo sapiens (Human)
Description:Q14831
Residue:915
BDBM50084137
NameBDBM50084137
Synonyms:2-Methyl-6-(phenylethynyl)pyridine 2-Methyl-6-phenylethynyl-pyridine(MPEP) 2-methyl-6-(phenyl-ethynyl)pyridine 6-methyl-2-(2-phenylethynyl)pyridine CHEMBL66654 US10618900, No. MPEP | [3H]-2-methyl-6-(phenylethynyl)-pyridine
TypeSmall organic molecule
Emp. Form.C14H11N
Mol. Mass.193.2438
SMILESCc1cccc(n1)C#Cc1ccccc1