Reaction Details
TargetMetabotropic glutamate receptor 5
LigandBDBM50007548
Substrate/Competitorn/a
Meas. Tech.ChEMBL_104277 (CHEMBL711712)
Ki>1000000±n/a nM
Citation Bräuner-Osborne, HEgebjerg, JNielsen, EOMadsen, UKrogsgaard-Larsen, P Ligands for glutamate receptors: design and therapeutic prospects. J Med Chem43:2609-45 (2000) Metabotropic glutamate receptor 5
Name:Metabotropic glutamate receptor 5
Type:Enzyme
Mol. Mass.:132484.72
Organism:Homo sapiens (Human)
Description:n/a
Residue:1212
BDBM50007548
NameBDBM50007548
Synonyms:(S)-2-Amino-4-phosphono-butyric acid 2-Amino-3-(3,5-dioxo-[1,2,4]oxadiazolidin-2-yl)-propionic acid 2-Amino-4-phosphono-butyric acid(S-AP4) 2-amino-4-phosphonobutyric acid L-(+)-2-amino-4-phosphonobutyric acid L-AP4 | L-APB
TypeSmall organic molecule
Emp. Form.C4H10NO5P
Mol. Mass.183.0997
SMILESN[C@@H](CCP(O)(O)=O)C(O)=O