Reaction Details
TargetMetabotropic glutamate receptor 3
LigandBDBM17660
Substrate/Competitorn/a
Meas. Tech.ChEMBL_106383 (CHEMBL717238)
Ki 40000±n/a nM
Citation Bräuner-Osborne, HEgebjerg, JNielsen, EOMadsen, UKrogsgaard-Larsen, P Ligands for glutamate receptors: design and therapeutic prospects. J Med Chem43:2609-45 (2000) Metabotropic glutamate receptor 3
Name:Metabotropic glutamate receptor 3
Type:Enzyme Catalytic Domain
Mol. Mass.:98889.09
Organism:Homo sapiens (Human)
Description:metabotropic glutamate 1c 0 HUMAN::Q14832
Residue:879
BDBM17660
NameBDBM17660
Synonyms:(2S)-2-amino-3-(3,5-dioxo-1,2,4-oxadiazolidin-2-yl)propanoic acid CHEMBL279956 Quisqualate, L | quisqualic acid
TypeSmall organic molecule
Emp. Form.C5H7N3O5
Mol. Mass.189.1262
SMILESN[C@@H](Cn1oc(=O)[nH]c1=O)C(O)=O