Reaction Details
TargetMetabotropic glutamate receptor 8
LigandBDBM50089897
Substrate/Competitorn/a
Meas. Tech.ChEMBL_104492 (CHEMBL712473)
Ki 7300±n/a nM
Citation Bräuner-Osborne, HEgebjerg, JNielsen, EOMadsen, UKrogsgaard-Larsen, P Ligands for glutamate receptors: design and therapeutic prospects. J Med Chem43:2609-45 (2000) Metabotropic glutamate receptor 8
Name:Metabotropic glutamate receptor 8
Type:Enzyme Catalytic Domain
Mol. Mass.:101759.58
Organism:Homo sapiens (Human)
Description:metabotropic glutamate 8 GRM8 HUMAN::O00222
Residue:908
BDBM50089897
NameBDBM50089897
Synonyms:4-Amino-2-thia-bicyclo[3.1.0]hexane-4,6-dicarboxylic acid(LY389795) | CHEMBL88999
TypeSmall organic molecule
Emp. Form.C7H9NO4S
Mol. Mass.203.216
SMILESN[C@]1(CSC2[C@@H](C12)C(O)=O)C(O)=O