Reaction Details
TargetMetabotropic glutamate receptor 8
LigandBDBM50034504
Substrate/Competitorn/a
Meas. Tech.ChEMBL_104492 (CHEMBL712473)
Ki 3400±n/a nM
Citation Bräuner-Osborne, HEgebjerg, JNielsen, EOMadsen, UKrogsgaard-Larsen, P Ligands for glutamate receptors: design and therapeutic prospects. J Med Chem43:2609-45 (2000) Metabotropic glutamate receptor 8
Name:Metabotropic glutamate receptor 8
Type:Enzyme Catalytic Domain
Mol. Mass.:101759.58
Organism:Homo sapiens (Human)
Description:metabotropic glutamate 8 GRM8 HUMAN::O00222
Residue:908
BDBM50034504
NameBDBM50034504
Synonyms:(1S,2S)-2-((S)-Amino-carboxy-methyl)-cyclopropanecarboxylic acid 2-(Amino-carboxy-methyl)-cyclopropanecarboxylic acid(2S,3S,4S-CCG) L-CCGI
TypeSmall organic molecule
Emp. Form.C6H9NO4
Mol. Mass.159.14
SMILESN[C@@H]([C@H]1C[C@@H]1C(O)=O)C(O)=O