Reaction Details
TargetMetabotropic glutamate receptor 8
LigandBDBM50089895
Substrate/Competitorn/a
Meas. Tech.ChEMBL_104492 (CHEMBL712473)
Ki 15000±n/a nM
Citation Bräuner-Osborne, HEgebjerg, JNielsen, EOMadsen, UKrogsgaard-Larsen, P Ligands for glutamate receptors: design and therapeutic prospects. J Med Chem43:2609-45 (2000) Metabotropic glutamate receptor 8
Name:Metabotropic glutamate receptor 8
Type:Enzyme Catalytic Domain
Mol. Mass.:101759.58
Organism:Homo sapiens (Human)
Description:metabotropic glutamate 8 GRM8 HUMAN::O00222
Residue:908
BDBM50089895
NameBDBM50089895
Synonyms:2-Amino-3-hydroxy-bicyclo[3.1.0]hexane-2,6-dicarboxylic acid(HYDIA) | CHEMBL330097
TypeSmall organic molecule
Emp. Form.C8H11NO5
Mol. Mass.201.1766
SMILESN[C@@]1(C2C(C[C@H]1O)[C@@H]2C(O)=O)C(O)=O