Reaction Details
TargetAdenosine receptor A1
LigandBDBM50090697
Substrate/Competitorn/a
Meas. Tech.ChEMBL_29105 (CHEMBL638717)
Ki 0.15±n/a nM
Citation Ferrarini, PLMori, CManera, CMartinelli, AMori, FSaccomanni, GBarili, PLBetti, LGiannaccini, GTrincavelli, LLucacchini, A A novel class of highly potent and selective A1 adenosine antagonists: structure-affinity profile of a series of 1,8-naphthyridine derivatives. J Med Chem43:2814-23 (2000) Adenosine receptor A1
Name:Adenosine receptor A1
Type:Enzyme Catalytic Domain
Mol. Mass.:36602.99
Organism:BOVINE
Description:ADENOSINE 0 BOVINE::P28190
Residue:326
BDBM50090697
NameBDBM50090697
Synonyms:7-Chloro-2-phenyl-[1,8]naphthyridin-4-ol CHEMBL97760
TypeSmall organic molecule
Emp. Form.C14H9ClN2O
Mol. Mass.256.687
SMILESOc1cc(nc2nc(Cl)ccc12)-c1ccccc1