Reaction Details
TargetAdenosine receptor A1
LigandBDBM50090699
Substrate/Competitorn/a
Meas. Tech.ChEMBL_29105 (CHEMBL638717)
Ki 4900±n/a nM
Citation Ferrarini, PLMori, CManera, CMartinelli, AMori, FSaccomanni, GBarili, PLBetti, LGiannaccini, GTrincavelli, LLucacchini, A A novel class of highly potent and selective A1 adenosine antagonists: structure-affinity profile of a series of 1,8-naphthyridine derivatives. J Med Chem43:2814-23 (2000) Adenosine receptor A1
Name:Adenosine receptor A1
Type:Enzyme Catalytic Domain
Mol. Mass.:36602.99
Organism:BOVINE
Description:ADENOSINE 0 BOVINE::P28190
Residue:326
BDBM50090699
NameBDBM50090699
Synonyms:5-Hydroxy-1-methyl-7-phenyl-1H-[1,8]naphthyridin-2-one CHEMBL328214
TypeSmall organic molecule
Emp. Form.C15H12N2O2
Mol. Mass.252.268
SMILESCn1c2nc(cc(O)c2ccc1=O)-c1ccccc1