Reaction Details
TargetAdenosine receptor A1
LigandBDBM50090704
Substrate/Competitorn/a
Meas. Tech.ChEMBL_29105 (CHEMBL638717)
Ki 28±n/a nM
Citation Ferrarini, PLMori, CManera, CMartinelli, AMori, FSaccomanni, GBarili, PLBetti, LGiannaccini, GTrincavelli, LLucacchini, A A novel class of highly potent and selective A1 adenosine antagonists: structure-affinity profile of a series of 1,8-naphthyridine derivatives. J Med Chem43:2814-23 (2000) Adenosine receptor A1
Name:Adenosine receptor A1
Type:Enzyme Catalytic Domain
Mol. Mass.:36602.99
Organism:BOVINE
Description:ADENOSINE 0 BOVINE::P28190
Residue:326
BDBM50090704
NameBDBM50090704
Synonyms:CHEMBL97624 N-cyclohexyl-7-methyl-2-phenyl-1,8-naphthyridin-4-amine
TypeSmall organic molecule
Emp. Form.C21H23N3
Mol. Mass.317.4274
SMILESCc1ccc2c(NC3CCCCC3)cc(nc2n1)-c1ccccc1