Reaction Details
TargetAdenosine receptor A2a
LigandBDBM50090704
Substrate/Competitorn/a
Meas. Tech.ChEMBL_31046 (CHEMBL642117)
Ki 830±n/a nM
Citation Ferrarini, PLMori, CManera, CMartinelli, AMori, FSaccomanni, GBarili, PLBetti, LGiannaccini, GTrincavelli, LLucacchini, A A novel class of highly potent and selective A1 adenosine antagonists: structure-affinity profile of a series of 1,8-naphthyridine derivatives. J Med Chem43:2814-23 (2000) Adenosine receptor A2a
Name:Adenosine receptor A2a
Type:G Protein-Coupled Receptor (GPCR)
Mol. Mass.:44716.46
Organism:Homo sapiens (Human)
Description:P29274
Residue:412
BDBM50090704
NameBDBM50090704
Synonyms:CHEMBL97624 N-cyclohexyl-7-methyl-2-phenyl-1,8-naphthyridin-4-amine
TypeSmall organic molecule
Emp. Form.C21H23N3
Mol. Mass.317.4274
SMILESCc1ccc2c(NC3CCCCC3)cc(nc2n1)-c1ccccc1