Reaction Details
TargetD(3) dopamine receptor
LigandBDBM50090834
Substrate/Competitorn/a
Meas. Tech.ChEMBL_60503 (CHEMBL673332)
Ki 29±n/a nM
Citation van Vliet, LARodenhuis, NDijkstra, DWikström, HPugsley, TASerpa, KAMeltzer, LTHeffner, TGWise, LDLajiness, MEHuff, RMSvensson, KSundell, SLundmark, M Synthesis and pharmacological evaluation of thiopyran analogues of the dopamine D3 receptor-selective agonist (4aR,10bR)-(+)-trans-3,4,4a,10b-tetrahydro-4-n-propyl-2H,5H [1]b enzopyrano[4,3-b]-1,4-oxazin-9-ol (PD 128907). J Med Chem43:2871-82 (2000) D(3) dopamine receptor
Name:D(3) dopamine receptor
Type:n/a
Mol. Mass.:44243.43
Organism:Homo sapiens (Human)
Description:n/a
Residue:400
BDBM50090834
NameBDBM50090834
Synonyms:9-Oxo-1-propyl-2,3,4a,9,10,10a-hexahydro-1H-4-oxa-9lambda*4*-thia-1-aza-phenanthren-6-ol | CHEMBL99355
TypeSmall organic molecule
Emp. Form.C14H19NO3S
Mol. Mass.281.371
SMILESCCCN1CCOC2C1CS(=O)c1ccc(O)cc21