Reaction Details
TargetProthrombin
LigandBDBM50091037
Substrate/Competitorn/a
Meas. Tech.ChEMBL_160849 (CHEMBL771784)
Ki 19±n/a nM
Citation Kastenholz, MAPastor, MCruciani, GHaaksma, EEFox, T GRID/CPCA: a new computational tool to design selective ligands. J Med Chem43:3033-44 (2000) Prothrombin
Name:Prothrombin
Type:Enzyme
Mol. Mass.:70502.73
Organism:Bos taurus (Bovine)
Description:P00735
Residue:625
BDBM50091037
NameBDBM50091037
Synonyms:1-[5-(Diaminomethyl-amino)-2-(3-methyl-1,2,3,4-tetrahydro-quinoline-8-sulfonylamino)-pentanoyl]-4-methyl-piperidine-2-carboxylic acid | CHEMBL177078
TypeSmall organic molecule
Emp. Form.C23H36N6O5S
Mol. Mass.508.634
SMILESC[C@@H]1CCN(C(C1)C(O)=O)C(=O)[C@H](CCCNC(N)=N)NS(=O)(=O)c1cccc2CC(C)CNc12