Reaction Details
TargetD(2) dopamine receptor
LigandBDBM50092173
Substrate/Competitorn/a
Meas. Tech.ChEMBL_61638 (CHEMBL671517)
Ki 27±n/a nM
Citation van Vliet, LARodenhuis, NWikström, HPugsley, TASerpa, KAMeltzer, LTHeffner, TGWise, LDLajiness, MEHuff, RMSvensson, KHaenen, GRBast, A Thiazoloindans and thiazolobenzopyrans: a novel class of orally active central dopamine (partial) agonists. J Med Chem43:3549-57 (2000) D(2) dopamine receptor
Name:D(2) dopamine receptor
Type:Cell-surface receptors
Mol. Mass.:50647.10
Organism:Homo sapiens (Human)
Description:P14416
Residue:443
BDBM50092173
NameBDBM50092173
Synonyms:CHEMBL325710 | N*6*,N*6*-Dipropyl-6,7-dihydro-5H-1-thia-3-aza-s-indacene-2,6-diamine
TypeSmall organic molecule
Emp. Form.C16H23N3S
Mol. Mass.289.439
SMILESCCCN(CCC)C1Cc2cc3nc(N)sc3cc2C1