Reaction Details
TargetD(3) dopamine receptor
LigandBDBM50092169
Substrate/Competitorn/a
Meas. Tech.ChEMBL_62616 (CHEMBL678239)
EC50>1000±n/a nM
Citation van Vliet, LARodenhuis, NWikström, HPugsley, TASerpa, KAMeltzer, LTHeffner, TGWise, LDLajiness, MEHuff, RMSvensson, KHaenen, GRBast, A Thiazoloindans and thiazolobenzopyrans: a novel class of orally active central dopamine (partial) agonists. J Med Chem43:3549-57 (2000) D(3) dopamine receptor
Name:D(3) dopamine receptor
Type:Protein
Mol. Mass.:49540.58
Organism:Rattus norvegicus (Rat)
Description:P19020
Residue:446
BDBM50092169
NameBDBM50092169
Synonyms:CHEMBL118636 | N*7*,N*7*-Dipropyl-7,8-dihydro-6H-1-thia-3-aza-as-indacene-2,7-diamine
TypeSmall organic molecule
Emp. Form.C16H23N3S
Mol. Mass.289.439
SMILESCCCN(CCC)C1Cc2ccc3nc(N)sc3c2C1