Reaction Details
TargetD(2) dopamine receptor
LigandBDBM50092170
Substrate/Competitorn/a
Meas. Tech.ChEMBL_61637 (CHEMBL671516)
Ki 47±n/a nM
Citation van Vliet, LARodenhuis, NWikström, HPugsley, TASerpa, KAMeltzer, LTHeffner, TGWise, LDLajiness, MEHuff, RMSvensson, KHaenen, GRBast, A Thiazoloindans and thiazolobenzopyrans: a novel class of orally active central dopamine (partial) agonists. J Med Chem43:3549-57 (2000) D(2) dopamine receptor
Name:D(2) dopamine receptor
Type:Cell-surface receptors
Mol. Mass.:50647.10
Organism:Homo sapiens (Human)
Description:P14416
Residue:443
BDBM50092170
NameBDBM50092170
Synonyms:CHEMBL116372 | N*8*,N*8*-Dipropyl-8,9-dihydro-7H-chromeno[6,5-d]thiazole-2,8-diamine
TypeSmall organic molecule
Emp. Form.C16H23N3OS
Mol. Mass.305.438
SMILESCCCN(CCC)C1COc2ccc3nc(N)sc3c2C1