Reaction Details
TargetKappa-type opioid receptor
LigandBDBM50092176
Substrate/Competitorn/a
Meas. Tech.ChEMBL_146503 (CHEMBL754612)
Ki 1.2±n/a nM
Citation Wentland, MPDuan, WCohen, DJBidlack, JM Selective protection and functionalization of morphine: synthesis and opioid receptor binding properties of 3-amino-3-desoxymorphine derivatives. J Med Chem43:3558-65 (2000) Kappa-type opioid receptor
Name:Kappa-type opioid receptor
Type:G Protein-Coupled Receptor (GPCR)
Mol. Mass.:42744.99
Organism:Cavia porcellus (domestic guinea pig)
Description:P41144
Residue:380
BDBM50092176
NameBDBM50092176
Synonyms:3-Cyclopropylmethyl-6,11-dimethyl-1,2,3,4,5,6-hexahydro-2,6-methano-benzo[d]azocin-8-ylamine | CHEMBL332017
TypeSmall organic molecule
Emp. Form.C18H26N2
Mol. Mass.270.4124
SMILESC[C@H]1[C@H]2Cc3ccc(N)cc3[C@@]1(C)CCN2CC1CC1