Reaction Details
TargetMu-type opioid receptor
LigandBDBM50084277
Substrate/Competitorn/a
Meas. Tech.ChEMBL_148224 (CHEMBL753233)
Ki 0.590000±n/a nM
Citation Husbands, SMLewis, JW Structural determinants of efficacy for kappa opioid receptors in the orvinol series: 7,7-spiro analogues of buprenorphine. J Med Chem43:139-41 (2000) Mu-type opioid receptor
Name:Mu-type opioid receptor
Type:G Protein-Coupled Receptor (GPCR)
Mol. Mass.:44789.51
Organism:Homo sapiens (Human)
Description:P35372
Residue:400
BDBM50084277
NameBDBM50084277
Synonyms:7,7-Spiro analogue ofBuprinorphine | CHEMBL31030
TypeSmall organic molecule
Emp. Form.C29H37NO4
Mol. Mass.463.6084
SMILESCO[C@]12C=CC3(CC11CCC(C)(C)[C@H]1O)C1Cc4ccc(O)c5O[C@H]2C3(CCN1CC1CC1)c45