Reaction Details
TargetSodium-dependent dopamine transporter
LigandBDBM50084333
Substrate/Competitorn/a
Meas. Tech.ChEMBL_61655 (CHEMBL670789)
Ki 30±n/a nM
Citation Choi, SWElmaleh, DRHanson, RNFischman, AJ Novel 3-aminomethyl- and 4-aminopiperidine analogues of 1-[2-(diphenylmethoxy)ethyl]-4-(3-phenylpropyl)piperazines: synthesis and evaluation as dopamine transporter ligands. J Med Chem43:205-13 (2000) Sodium-dependent dopamine transporter
Name:Sodium-dependent dopamine transporter
Type:Multi-pass membrane protein
Mol. Mass.:68497.11
Organism:Homo sapiens (Human)
Description:Q01959
Residue:620
BDBM50084333
NameBDBM50084333
Synonyms:(2-Benzhydryloxy-ethyl)-[1-(3-phenyl-propyl)-piperidin-4-yl]-amine | CHEMBL417049
TypeSmall organic molecule
Emp. Form.C30H38N2O
Mol. Mass.442.6355
SMILESCN(CCOC(c1ccccc1)c1ccccc1)C1CCN(CCCc2ccccc2)CC1