Reaction Details
TargetSodium-dependent serotonin transporter
LigandBDBM50084334
Substrate/Competitorn/a
Meas. Tech.ChEMBL_201369 (CHEMBL872702)
Ki 55±n/a nM
Citation Choi, SWElmaleh, DRHanson, RNFischman, AJ Novel 3-aminomethyl- and 4-aminopiperidine analogues of 1-[2-(diphenylmethoxy)ethyl]-4-(3-phenylpropyl)piperazines: synthesis and evaluation as dopamine transporter ligands. J Med Chem43:205-13 (2000) Sodium-dependent serotonin transporter
Name:Sodium-dependent serotonin transporter
Type:Multi-pass membrane protein
Mol. Mass.:70322.51
Organism:Homo sapiens (Human)
Description:P31645
Residue:630
BDBM50084334
NameBDBM50084334
Synonyms:CHEMBL421867 | [1-(2-Benzhydryloxy-ethyl)-piperidin-4-yl]-(3-phenyl-propyl)-amine
TypeSmall organic molecule
Emp. Form.C29H36N2O
Mol. Mass.428.6089
SMILESC(CNC1CCN(CCOC(c2ccccc2)c2ccccc2)CC1)Cc1ccccc1