Reaction Details
TargetSodium-dependent noradrenaline transporter
LigandBDBM50084336
Substrate/Competitorn/a
Meas. Tech.ChEMBL_140881 (CHEMBL752512)
Ki 110±n/a nM
Citation Choi, SWElmaleh, DRHanson, RNFischman, AJ Novel 3-aminomethyl- and 4-aminopiperidine analogues of 1-[2-(diphenylmethoxy)ethyl]-4-(3-phenylpropyl)piperazines: synthesis and evaluation as dopamine transporter ligands. J Med Chem43:205-13 (2000) Sodium-dependent noradrenaline transporter
Name:Sodium-dependent noradrenaline transporter
Type:Multi-pass membrane protein
Mol. Mass.:69337.72
Organism:Homo sapiens (Human)
Description:P23975
Residue:617
BDBM50084336
NameBDBM50084336
Synonyms:CHEMBL69380 | [1-(2-Benzhydryloxy-ethyl)-piperidin-3-ylmethyl]-[2-(4-fluoro-phenyl)-ethyl]-methyl-amine
TypeSmall organic molecule
Emp. Form.C30H37FN2O
Mol. Mass.460.626
SMILESCN(CCc1ccc(F)cc1)CC1CCCN(CCOC(c2ccccc2)c2ccccc2)C1