Reaction Details
TargetSodium-dependent dopamine transporter
LigandBDBM50084332
Substrate/Competitorn/a
Meas. Tech.ChEMBL_61655 (CHEMBL670789)
Ki 18±n/a nM
Citation Choi, SWElmaleh, DRHanson, RNFischman, AJ Novel 3-aminomethyl- and 4-aminopiperidine analogues of 1-[2-(diphenylmethoxy)ethyl]-4-(3-phenylpropyl)piperazines: synthesis and evaluation as dopamine transporter ligands. J Med Chem43:205-13 (2000) Sodium-dependent dopamine transporter
Name:Sodium-dependent dopamine transporter
Type:Multi-pass membrane protein
Mol. Mass.:68497.11
Organism:Homo sapiens (Human)
Description:Q01959
Residue:620
BDBM50084332
NameBDBM50084332
Synonyms:(2-Benzhydryloxy-ethyl)-[1-(3-phenyl-propyl)-piperidin-3-ylmethyl]-amine | CHEMBL67203
TypeSmall organic molecule
Emp. Form.C30H38N2O
Mol. Mass.442.6355
SMILESC(CN1CCCC(CNCCOC(c2ccccc2)c2ccccc2)C1)Cc1ccccc1