Reaction Details
TargetSodium-dependent serotonin transporter
LigandBDBM50084335
Substrate/Competitorn/a
Meas. Tech.ChEMBL_201369 (CHEMBL872702)
Ki 220±n/a nM
Citation Choi, SWElmaleh, DRHanson, RNFischman, AJ Novel 3-aminomethyl- and 4-aminopiperidine analogues of 1-[2-(diphenylmethoxy)ethyl]-4-(3-phenylpropyl)piperazines: synthesis and evaluation as dopamine transporter ligands. J Med Chem43:205-13 (2000) Sodium-dependent serotonin transporter
Name:Sodium-dependent serotonin transporter
Type:Multi-pass membrane protein
Mol. Mass.:70322.51
Organism:Homo sapiens (Human)
Description:P31645
Residue:630
BDBM50084335
NameBDBM50084335
Synonyms:CHEMBL67024 | [1-(2-Benzhydryloxy-ethyl)-piperidin-4-yl]-[2-(4-fluoro-phenyl)-ethyl]-amine
TypeSmall organic molecule
Emp. Form.C28H33FN2O
Mol. Mass.432.5728
SMILESFc1ccc(CCNC2CCN(CCOC(c3ccccc3)c3ccccc3)CC2)cc1