Reaction Details
TargetSodium-dependent dopamine transporter
LigandBDBM50084336
Substrate/Competitorn/a
Meas. Tech.ChEMBL_61655 (CHEMBL670789)
Ki 90±n/a nM
Citation Choi, SWElmaleh, DRHanson, RNFischman, AJ Novel 3-aminomethyl- and 4-aminopiperidine analogues of 1-[2-(diphenylmethoxy)ethyl]-4-(3-phenylpropyl)piperazines: synthesis and evaluation as dopamine transporter ligands. J Med Chem43:205-13 (2000) Sodium-dependent dopamine transporter
Name:Sodium-dependent dopamine transporter
Type:Multi-pass membrane protein
Mol. Mass.:68497.11
Organism:Homo sapiens (Human)
Description:Q01959
Residue:620
BDBM50084336
NameBDBM50084336
Synonyms:CHEMBL69380 | [1-(2-Benzhydryloxy-ethyl)-piperidin-3-ylmethyl]-[2-(4-fluoro-phenyl)-ethyl]-methyl-amine
TypeSmall organic molecule
Emp. Form.C30H37FN2O
Mol. Mass.460.626
SMILESCN(CCc1ccc(F)cc1)CC1CCCN(CCOC(c2ccccc2)c2ccccc2)C1