Reaction Details
TargetAdenosine receptor A2a
LigandBDBM50369058
Substrate/Competitorn/a
Meas. Tech.ChEMBL_29992 (CHEMBL642180)
Ki 9200±n/a nM
Citation Vittori, SLorenzen, AStannek, CCostanzi, SVolpini, RIJzerman, APKunzel, JKCristalli, G N-cycloalkyl derivatives of adenosine and 1-deazaadenosine as agonists and partial agonists of the A(1) adenosine receptor. J Med Chem43:250-60 (2000) Adenosine receptor A2a
Name:Adenosine receptor A2a
Type:G Protein-Coupled Receptor (GPCR)
Mol. Mass.:45015.65
Organism:Rattus norvegicus (rat)
Description:Rat A2A receptors expressed in CHO cells.
Residue:410
BDBM50369058
NameBDBM50369058
Synonyms:CHEMBL611851
TypeSmall organic molecule
Emp. Form.C18H26N4O4
Mol. Mass.362.4234
SMILESOC[C@H]1OC([C@H](O)[C@@H]1O)n1cnc2c(NC3CCCCCC3)ccnc12