Reaction Details
TargetReverse transcriptase/RNaseH
LigandBDBM50094295
Substrate/Competitorn/a
Meas. Tech.ChEMBL_79464 (CHEMBL694660)
EC50 650±n/a nM
Citation Ohrui, HKohgo, SKitano, KSakata, SKodama, EYoshimura, KMatsuoka, MShigeta, SMitsuya, H Syntheses of 4'-C-ethynyl-beta-D-arabino- and 4'-C-ethynyl-2'-deoxy-beta-D-ribo-pentofuranosylpyrimidines and -purines and evaluation of their anti-HIV activity. J Med Chem43:4516-25 (2000) Reverse transcriptase/RNaseH
Name:Reverse transcriptase/RNaseH
Type:PROTEIN
Mol. Mass.:65229.15
Organism:Human immunodeficiency virus 1
Description:ChEMBL_1473730
Residue:566
BDBM50094295
NameBDBM50094295
Synonyms:9-(5-Ethynyl-4-hydroxy-5-hydroxymethyl-tetrahydro-furan-2-yl)-9H-purin-6-ol | CHEMBL336259
TypeSmall organic molecule
Emp. Form.C12H12N4O4
Mol. Mass.276.2481
SMILESOC[C@]1(O[C@H](C[C@H]1O)n1cnc2c1nc[nH]c2=O)C#C