Reaction Details
TargetReverse transcriptase/RNaseH
LigandBDBM50094282
Substrate/Competitorn/a
Meas. Tech.ChEMBL_79461 (CHEMBL694657)
EC50 1.4±n/a nM
Citation Ohrui, HKohgo, SKitano, KSakata, SKodama, EYoshimura, KMatsuoka, MShigeta, SMitsuya, H Syntheses of 4'-C-ethynyl-beta-D-arabino- and 4'-C-ethynyl-2'-deoxy-beta-D-ribo-pentofuranosylpyrimidines and -purines and evaluation of their anti-HIV activity. J Med Chem43:4516-25 (2000) Reverse transcriptase/RNaseH
Name:Reverse transcriptase/RNaseH
Type:PROTEIN
Mol. Mass.:65229.15
Organism:Human immunodeficiency virus 1
Description:ChEMBL_1473730
Residue:566
BDBM50094282
NameBDBM50094282
Synonyms:2-Amino-9-(5-ethynyl-4-hydroxy-5-hydroxymethyl-tetrahydro-furan-2-yl)-9H-purin-6-ol | CHEMBL337775
TypeSmall organic molecule
Emp. Form.C12H13N5O4
Mol. Mass.291.2627
SMILESNc1nc2n(cnc2c(=O)[nH]1)[C@H]1C[C@@H](O)[C@@](CO)(O1)C#C