Reaction Details
TargetReverse transcriptase/RNaseH
LigandBDBM50409052
Substrate/Competitorn/a
Meas. Tech.ChEMBL_79461 (CHEMBL694657)
EC50>100000±n/a nM
Citation Ohrui, HKohgo, SKitano, KSakata, SKodama, EYoshimura, KMatsuoka, MShigeta, SMitsuya, H Syntheses of 4'-C-ethynyl-beta-D-arabino- and 4'-C-ethynyl-2'-deoxy-beta-D-ribo-pentofuranosylpyrimidines and -purines and evaluation of their anti-HIV activity. J Med Chem43:4516-25 (2000) Reverse transcriptase/RNaseH
Name:Reverse transcriptase/RNaseH
Type:PROTEIN
Mol. Mass.:65229.15
Organism:Human immunodeficiency virus 1
Description:ChEMBL_1473730
Residue:566
BDBM50409052
NameBDBM50409052
Synonyms:CHEMBL141512
TypeSmall organic molecule
Emp. Form.C11H12ClN3O4
Mol. Mass.285.684
SMILESNc1nc(=O)n(cc1Cl)[C@H]1C[C@@H](O)[C@@](CO)(O1)C#C