Reaction Details
TargetReverse transcriptase/RNaseH
LigandBDBM50409053
Substrate/Competitorn/a
Meas. Tech.ChEMBL_79461 (CHEMBL694657)
EC50>10000±n/a nM
Citation Ohrui, HKohgo, SKitano, KSakata, SKodama, EYoshimura, KMatsuoka, MShigeta, SMitsuya, H Syntheses of 4'-C-ethynyl-beta-D-arabino- and 4'-C-ethynyl-2'-deoxy-beta-D-ribo-pentofuranosylpyrimidines and -purines and evaluation of their anti-HIV activity. J Med Chem43:4516-25 (2000) Reverse transcriptase/RNaseH
Name:Reverse transcriptase/RNaseH
Type:PROTEIN
Mol. Mass.:65229.15
Organism:Human immunodeficiency virus 1
Description:ChEMBL_1473730
Residue:566
BDBM50409053
NameBDBM50409053
Synonyms:CHEMBL140839
TypeSmall organic molecule
Emp. Form.C11H11FN2O5
Mol. Mass.270.2138
SMILESOC[C@]1(O[C@H](C[C@H]1O)n1cc(F)c(=O)[nH]c1=O)C#C