Reaction Details
TargetReverse transcriptase/RNaseH
LigandBDBM50409056
Substrate/Competitorn/a
Meas. Tech.ChEMBL_79461 (CHEMBL694657)
EC50 2300±n/a nM
Citation Ohrui, HKohgo, SKitano, KSakata, SKodama, EYoshimura, KMatsuoka, MShigeta, SMitsuya, H Syntheses of 4'-C-ethynyl-beta-D-arabino- and 4'-C-ethynyl-2'-deoxy-beta-D-ribo-pentofuranosylpyrimidines and -purines and evaluation of their anti-HIV activity. J Med Chem43:4516-25 (2000) Reverse transcriptase/RNaseH
Name:Reverse transcriptase/RNaseH
Type:PROTEIN
Mol. Mass.:65229.15
Organism:Human immunodeficiency virus 1
Description:ChEMBL_1473730
Residue:566
BDBM50409056
NameBDBM50409056
Synonyms:CHEMBL141617
TypeSmall organic molecule
Emp. Form.C11H11BrN2O5
Mol. Mass.331.119
SMILESOC[C@]1(O[C@H](C[C@H]1O)n1cc(Br)c(=O)[nH]c1=O)C#C