Reaction Details
TargetProstaglandin G/H synthase 2
LigandBDBM50094539
Substrate/Competitorn/a
Meas. Tech.ChEMBL_157848 (CHEMBL768586)
IC50 1.1±n/a nM
Citation Portevin, BTordjman, CPastoureau, PBonnet, JDe Nanteuil G, na 1,3-Diaryl-4,5,6,7-tetrahydro-2H-isoindole derivatives: a new series of potent and selective COX-2 inhibitors in which a sulfonyl group is not a structural requisite. J Med Chem43:4582-93 (2001) Prostaglandin G/H synthase 2
Name:Prostaglandin G/H synthase 2
Type:Protein
Mol. Mass.:69020.39
Organism:Mus musculus (Mouse)
Description:Q05769
Residue:604
BDBM50094539
NameBDBM50094539
Synonyms:3,5-Bis-(4-fluoro-phenyl)-4-aza-tricyclo[5.2.1.0*2,6*]deca-2,5-diene | CHEMBL143776
TypeSmall organic molecule
Emp. Form.C21H17F2N
Mol. Mass.321.3632
SMILESFc1ccc(cc1)-c1[nH]c(c2C3CCC(C3)c12)-c1ccc(F)cc1