Reaction Details
TargetProstaglandin G/H synthase 2
LigandBDBM50094541
Substrate/Competitorn/a
Meas. Tech.ChEMBL_157848 (CHEMBL768586)
IC50 5±n/a nM
Citation Portevin, BTordjman, CPastoureau, PBonnet, JDe Nanteuil G, na 1,3-Diaryl-4,5,6,7-tetrahydro-2H-isoindole derivatives: a new series of potent and selective COX-2 inhibitors in which a sulfonyl group is not a structural requisite. J Med Chem43:4582-93 (2001) Prostaglandin G/H synthase 2
Name:Prostaglandin G/H synthase 2
Type:Protein
Mol. Mass.:69020.39
Organism:Mus musculus (Mouse)
Description:Q05769
Residue:604
BDBM50094541
NameBDBM50094541
Synonyms:1,3-Bis-(4-chloro-phenyl)-4,5,6,7-tetrahydro-2H-isoindole CHEMBL140726
TypeSmall organic molecule
Emp. Form.C20H17Cl2N
Mol. Mass.342.262
SMILESClc1ccc(cc1)-c1[nH]c(c2CCCCc12)-c1ccc(Cl)cc1