Reaction Details
TargetAcyl carrier protein,/NADH dehydrogenase [ubiquinone] flavoprotein 1, mitochondrial
LigandBDBM50094717
Substrate/Competitorn/a
Meas. Tech.ChEMBL_141740 (CHEMBL749252)
IC50 2.1±n/a nM
Citation Gallardo, TZafra-Polo, MCTormo, JRGonzález, MCFranck, XEstornell, ECortes, D Semisynthesis of antitumoral acetogenins: SAR of functionalized alkyl-chain bis-tetrahydrofuranic acetogenins, specific inhibitors of mitochondrial complex I. J Med Chem43:4793-800 (2000) Acyl carrier protein,/NADH dehydrogenase [ubiquinone] flavoprotein 1, mitochondrial
Name:Acyl carrier protein,/NADH dehydrogenase [ubiquinone] flavoprotein 1, mitochondrial
Synonyms:Mitochondrial complex I; NADH oxidoreductase
Type:n/a
Mol. Mass.:n/a
Description:ASSAY_ID of EBI is 141738
Components:This complex has 2 components.
Component 1
Name:NADH dehydrogenase [ubiquinone] flavoprotein 1, mitochondrial
Type:PROTEIN
Mol. Mass.:50659.85
Organism:Bos taurus
Description:EBI_100771
Residue:464
Component 2
Name:Acyl carrier protein, mitochondrial
Synonyms:ACP CI-SDAP NDUFAB1
Type:PROTEIN
Mol. Mass.:17397.64
Organism:Bos taurus
Description:ChEMBL_469770
Residue:156
BDBM50094717
NameBDBM50094717
Synonyms:Acetic acid 1-[5'-(1,6-diacetoxy-undecyl)-octahydro-[2,2']bifuranyl-5-yl]-13-(5-methyl-2-oxo-2,5-dihydro-furan-3-yl)-tridecyl ester | CHEMBL357600
TypeSmall organic molecule
Emp. Form.C43H72O10
Mol. Mass.749.0258
SMILESCCCCCC(CCCC[C@H](OC(C)=O)[C@H]1CC[C@@H](O1)[C@H]1CC[C@@H](O1)[C@@H](CCCCCCCCCCCCC1=C[C@H](C)OC1=O)OC(C)=O)OC(C)=O