Reaction Details
TargetProtein farnesyltransferase subunit beta/geranylgeranyltransferase type-1 subunit alpha
LigandBDBM50084824
Substrate/Competitorn/a
Meas. Tech.ChEMBL_70747 (CHEMBL681607)
IC50 100000±n/a nM
Citation Perola, EXu, KKollmeyer, TMKaufmann, SHPrendergast, FGPang, YP Successful virtual screening of a chemical database for farnesyltransferase inhibitor leads. J Med Chem43:401-8 (2000) Protein farnesyltransferase subunit beta/geranylgeranyltransferase type-1 subunit alpha
Name:Protein farnesyltransferase subunit beta/geranylgeranyltransferase type-1 subunit alpha
Type:n/a
Mol. Mass.:n/a
Description:ASSAY_ID of EBI is 69815
Components:This complex has 2 components.
Component 1
Name:Protein farnesyltransferase subunit beta
Synonyms:CAAX farnesyltransferase subunit beta FTase-beta Protein farnesyltransferase Ras proteins prenyltransferase subunit beta
Type:PROTEIN
Mol. Mass.:48666.41
Organism:Rattus norvegicus
Description:EBI_10573
Residue:437
Component 2
Name:Protein farnesyltransferase/geranylgeranyltransferase type-1 subunit alpha
Synonyms:CAAX farnesyltransferase alpha subunit FTase-alpha GGTase-I-alpha Protein farnesyltransferase/geranylgeranyltransferase type I alpha subunit Type I protein geranyl-geranyltransferase alpha subunit | geranylgeranyltransferase type-I
Type:Enzyme
Mol. Mass.:44030.14
Organism:Rattus norvegicus (rat)
Description:Recombinant rat enzyme.
Residue:377
BDBM50084824
NameBDBM50084824
Synonyms:4-Nitro-2-(2,4,5,7-tetranitro-fluoren-9-ylidenemethyl)-phenol | CHEMBL335510
TypeSmall organic molecule
Emp. Form.C20H9N5O11
Mol. Mass.495.3124
SMILES[#8]-c1ccc(cc1\[#6]=[#6]-1\c2cc(cc(c2-c2c-1cc(cc2-[#7+](-[#8-])=O)-[#7+](-[#8-])=O)-[#7+](-[#8-])=O)-[#7+](-[#8-])=O)-[#7+](-[#8-])=O