Reaction Details
TargetProtein farnesyltransferase subunit beta/geranylgeranyltransferase type-1 subunit alpha
LigandBDBM50369776
Substrate/Competitorn/a
Meas. Tech.ChEMBL_70747 (CHEMBL681607)
IC50 25000±n/a nM
Citation Perola, EXu, KKollmeyer, TMKaufmann, SHPrendergast, FGPang, YP Successful virtual screening of a chemical database for farnesyltransferase inhibitor leads. J Med Chem43:401-8 (2000) Protein farnesyltransferase subunit beta/geranylgeranyltransferase type-1 subunit alpha
Name:Protein farnesyltransferase subunit beta/geranylgeranyltransferase type-1 subunit alpha
Type:n/a
Mol. Mass.:n/a
Description:ASSAY_ID of EBI is 69815
Components:This complex has 2 components.
Component 1
Name:Protein farnesyltransferase subunit beta
Synonyms:CAAX farnesyltransferase subunit beta FTase-beta Protein farnesyltransferase Ras proteins prenyltransferase subunit beta
Type:PROTEIN
Mol. Mass.:48666.41
Organism:Rattus norvegicus
Description:EBI_10573
Residue:437
Component 2
Name:Protein farnesyltransferase/geranylgeranyltransferase type-1 subunit alpha
Synonyms:CAAX farnesyltransferase alpha subunit FTase-alpha GGTase-I-alpha Protein farnesyltransferase/geranylgeranyltransferase type I alpha subunit Type I protein geranyl-geranyltransferase alpha subunit | geranylgeranyltransferase type-I
Type:Enzyme
Mol. Mass.:44030.14
Organism:Rattus norvegicus (rat)
Description:Recombinant rat enzyme.
Residue:377
BDBM50369776
NameBDBM50369776
Synonyms:CHEMBL298301
TypeSmall organic molecule
Emp. Form.C15H6Cl6N4O6
Mol. Mass.550.949
SMILES[O-][N+](=O)c1ccc(NN2C(=O)C3C(C2=O)[C@@]2(Cl)C(Cl)=C(Cl)[C@]3(Cl)C2(Cl)Cl)c(c1)[N+]([O-])=O