Reaction Details
TargetTripeptidyl-peptidase 2
LigandBDBM50085073
Substrate/Competitorn/a
Meas. Tech.ChEMBL_211948 (CHEMBL816538)
Ki 50000±n/a nM
Citation Ganellin, CRBishop, PBBambal, RBChan, SMLaw, JKMarabout, BLuthra, PMMoore, ANPeschard, OBourgeat, PRose, CVargas, FSchwartz, JC Inhibitors of tripeptidyl peptidase II. 2. Generation of the first novel lead inhibitor of cholecystokinin-8-inactivating peptidase: a strategy for the design of peptidase inhibitors. J Med Chem43:664-74 (2000) Tripeptidyl-peptidase 2
Name:Tripeptidyl-peptidase 2
Type:PROTEIN
Mol. Mass.:138287.08
Organism:Rattus norvegicus
Description:ChEMBL_211948
Residue:1249
BDBM50085073
NameBDBM50085073
Synonyms:3-Amino-N-[1-(1-carboxy-3-methylsulfanyl-propylcarbamoyl)-2-(4-hydroxy-phenyl)-ethyl]-succinamic acid | CHEMBL161354
TypeSmall organic molecule
Emp. Form.C18H25N3O7S
Mol. Mass.427.472
SMILESCSCCC(NC(=O)C(Cc1ccc(O)cc1)NC(=O)C(N)CC(O)=O)C(O)=O