Reaction Details
TargetTripeptidyl-peptidase 2
LigandBDBM50085102
Substrate/Competitorn/a
Meas. Tech.ChEMBL_211948 (CHEMBL816538)
Ki 22000±n/a nM
Citation Ganellin, CRBishop, PBBambal, RBChan, SMLaw, JKMarabout, BLuthra, PMMoore, ANPeschard, OBourgeat, PRose, CVargas, FSchwartz, JC Inhibitors of tripeptidyl peptidase II. 2. Generation of the first novel lead inhibitor of cholecystokinin-8-inactivating peptidase: a strategy for the design of peptidase inhibitors. J Med Chem43:664-74 (2000) Tripeptidyl-peptidase 2
Name:Tripeptidyl-peptidase 2
Type:PROTEIN
Mol. Mass.:138287.08
Organism:Rattus norvegicus
Description:ChEMBL_211948
Residue:1249
BDBM50085102
NameBDBM50085102
Synonyms:2-Amino-3-methyl-N-(1-methylcarbamoyl-2-phenyl-ethyl)-butyramide (1.25CF3COOH) | CHEMBL158167
TypeSmall organic molecule
Emp. Form.C15H23N3O2
Mol. Mass.277.362
SMILESCNC(=O)C(Cc1ccccc1)NC(=O)C(N)C(C)C