Reaction Details
TargetTripeptidyl-peptidase 2
LigandBDBM50085106
Substrate/Competitorn/a
Meas. Tech.ChEMBL_211948 (CHEMBL816538)
Ki 20000±n/a nM
Citation Ganellin, CRBishop, PBBambal, RBChan, SMLaw, JKMarabout, BLuthra, PMMoore, ANPeschard, OBourgeat, PRose, CVargas, FSchwartz, JC Inhibitors of tripeptidyl peptidase II. 2. Generation of the first novel lead inhibitor of cholecystokinin-8-inactivating peptidase: a strategy for the design of peptidase inhibitors. J Med Chem43:664-74 (2000) Tripeptidyl-peptidase 2
Name:Tripeptidyl-peptidase 2
Type:PROTEIN
Mol. Mass.:138287.08
Organism:Rattus norvegicus
Description:ChEMBL_211948
Residue:1249
BDBM50085106
NameBDBM50085106
Synonyms:2-[2-(2-Amino-acetylamino)-3-(1H-indol-3-yl)-propionylamino]-4-methylsulfanyl-butyric acid | CHEMBL161301
TypeSmall organic molecule
Emp. Form.C18H24N4O4S
Mol. Mass.392.473
SMILESCSCCC(NC(=O)C(Cc1c[nH]c2ccccc12)NC(=O)CN)C(O)=O