Reaction Details
TargetTripeptidyl-peptidase 2
LigandBDBM50085116
Substrate/Competitorn/a
Meas. Tech.ChEMBL_211948 (CHEMBL816538)
Ki 3000±n/a nM
Citation Ganellin, CRBishop, PBBambal, RBChan, SMLaw, JKMarabout, BLuthra, PMMoore, ANPeschard, OBourgeat, PRose, CVargas, FSchwartz, JC Inhibitors of tripeptidyl peptidase II. 2. Generation of the first novel lead inhibitor of cholecystokinin-8-inactivating peptidase: a strategy for the design of peptidase inhibitors. J Med Chem43:664-74 (2000) Tripeptidyl-peptidase 2
Name:Tripeptidyl-peptidase 2
Type:PROTEIN
Mol. Mass.:138287.08
Organism:Rattus norvegicus
Description:ChEMBL_211948
Residue:1249
BDBM50085116
NameBDBM50085116
Synonyms:2-(2-Amino-3-methyl-butyrylamino)-pentanoic acid butylamide | CHEMBL351812
TypeSmall organic molecule
Emp. Form.C14H29N3O2
Mol. Mass.271.399
SMILESCCCCNC(=O)C(CCC)NC(=O)C(N)C(C)C