Reaction Details
TargetTripeptidyl-peptidase 2
LigandBDBM50085129
Substrate/Competitorn/a
Meas. Tech.ChEMBL_211948 (CHEMBL816538)
Ki 29000±n/a nM
Citation Ganellin, CRBishop, PBBambal, RBChan, SMLaw, JKMarabout, BLuthra, PMMoore, ANPeschard, OBourgeat, PRose, CVargas, FSchwartz, JC Inhibitors of tripeptidyl peptidase II. 2. Generation of the first novel lead inhibitor of cholecystokinin-8-inactivating peptidase: a strategy for the design of peptidase inhibitors. J Med Chem43:664-74 (2000) Tripeptidyl-peptidase 2
Name:Tripeptidyl-peptidase 2
Type:PROTEIN
Mol. Mass.:138287.08
Organism:Rattus norvegicus
Description:ChEMBL_211948
Residue:1249
BDBM50085129
NameBDBM50085129
Synonyms:2-[2-(2-Amino-acetylamino)-3-methyl-butyrylamino]-3-phenyl-propionic acid (0.4H2O) | CHEMBL161335
TypeSmall organic molecule
Emp. Form.C16H23N3O4
Mol. Mass.321.3715
SMILESCC(C)C(NC(=O)CN)C(=O)NC(Cc1ccccc1)C(O)=O