Reaction Details
TargetP2Y purinoceptor 1
LigandBDBM50085817
Substrate/Competitorn/a
Meas. Tech.ChEMBL_222620 (CHEMBL846295)
IC50 566±n/a nM
Citation Nandanan, EJang, SYMoro, SKim, HOSiddiqui, MARuss, PMarquez, VEBusson, RHerdewijn, PHarden, TKBoyer, JLJacobson, KA Synthesis, biological activity, and molecular modeling of ribose-modified deoxyadenosine bisphosphate analogues as P2Y(1) receptor ligands. J Med Chem43:829-42 (2000) P2Y purinoceptor 1
Name:P2Y purinoceptor 1
Type:n/a
Mol. Mass.:41199.64
Organism:Meleagris gallopavo
Description:n/a
Residue:362
BDBM50085817
NameBDBM50085817
Synonyms:CHEMBL352881 | Phosphoric acid mono-[5-(2-chloro-6-methylamino-purin-9-yl)-2-phosphonooxymethyl-tetrahydro-pyran-3-yl] ester
TypeSmall organic molecule
Emp. Form.C12H18ClN5O9P2
Mol. Mass.473.7
SMILESCNc1nc(Cl)nc2n(cnc12)C1COC(COP(O)(O)=O)C(C1)OP(O)(O)=O