Reaction Details
TargetP2Y purinoceptor 1
LigandBDBM50085313
Substrate/Competitorn/a
Meas. Tech.ChEMBL_222620 (CHEMBL846295)
IC50 2530±n/a nM
Citation Nandanan, EJang, SYMoro, SKim, HOSiddiqui, MARuss, PMarquez, VEBusson, RHerdewijn, PHarden, TKBoyer, JLJacobson, KA Synthesis, biological activity, and molecular modeling of ribose-modified deoxyadenosine bisphosphate analogues as P2Y(1) receptor ligands. J Med Chem43:829-42 (2000) P2Y purinoceptor 1
Name:P2Y purinoceptor 1
Type:n/a
Mol. Mass.:41199.64
Organism:Meleagris gallopavo
Description:n/a
Residue:362
BDBM50085313
NameBDBM50085313
Synonyms:CHEMBL165225 Phosphoric acid mono-[4-(6-amino-purin-9-ylmethyl)-2-phosphonooxymethyl-cyclopentyl] ester
TypeSmall organic molecule
Emp. Form.C11H17N5O8P2
Mol. Mass.409.2289
SMILESNc1ncnc2n(cnc12)[C@@H]1C[C@H](COP(O)(O)=O)[C@@H](C1)OP(O)(O)=O