Reaction Details
TargetP2Y purinoceptor 1
LigandBDBM50085825
Substrate/Competitorn/a
Meas. Tech.ChEMBL_147720 (CHEMBL759190)
EC50 155±n/a nM
Citation Nandanan, EJang, SYMoro, SKim, HOSiddiqui, MARuss, PMarquez, VEBusson, RHerdewijn, PHarden, TKBoyer, JLJacobson, KA Synthesis, biological activity, and molecular modeling of ribose-modified deoxyadenosine bisphosphate analogues as P2Y(1) receptor ligands. J Med Chem43:829-42 (2000) P2Y purinoceptor 1
Name:P2Y purinoceptor 1
Type:n/a
Mol. Mass.:41199.64
Organism:Meleagris gallopavo
Description:n/a
Residue:362
BDBM50085825
NameBDBM50085825
Synonyms:CHEMBL353178 | Phosphoric acid mono-[4-(6-amino-purin-9-yl)-1-phosphonooxymethyl-bicyclo[3.1.0]hex-2-yl] ester
TypeSmall organic molecule
Emp. Form.C12H17N5O8P2
Mol. Mass.421.2396
SMILESNc1ncnc2n(cnc12)C1CC(OP(O)(O)=O)C2(COP(O)(O)=O)CC12