Reaction Details
TargetP2Y purinoceptor 1
LigandBDBM50085826
Substrate/Competitorn/a
Meas. Tech.ChEMBL_222620 (CHEMBL846295)
IC50 362±n/a nM
Citation Nandanan, EJang, SYMoro, SKim, HOSiddiqui, MARuss, PMarquez, VEBusson, RHerdewijn, PHarden, TKBoyer, JLJacobson, KA Synthesis, biological activity, and molecular modeling of ribose-modified deoxyadenosine bisphosphate analogues as P2Y(1) receptor ligands. J Med Chem43:829-42 (2000) P2Y purinoceptor 1
Name:P2Y purinoceptor 1
Type:n/a
Mol. Mass.:41199.64
Organism:Meleagris gallopavo
Description:n/a
Residue:362
BDBM50085826
NameBDBM50085826
Synonyms:CHEMBL167061 | Phosphoric acid mono-[5-(6-methylamino-2-methylsulfanyl-purin-9-yl)-2-phosphonooxy-tetrahydro-furan-3-yl] ester
TypeSmall organic molecule
Emp. Form.C12H19N5O9P2S
Mol. Mass.471.32
SMILESCNc1nc(SC)nc2n(cnc12)[C@H]1C[C@@H](OP(O)(O)=O)[C@@H](COP(O)(O)=O)O1