Reaction Details
TargetP2Y purinoceptor 1
LigandBDBM50085827
Substrate/Competitorn/a
Meas. Tech.ChEMBL_147720 (CHEMBL759190)
EC50 41000±n/a nM
Citation Nandanan, EJang, SYMoro, SKim, HOSiddiqui, MARuss, PMarquez, VEBusson, RHerdewijn, PHarden, TKBoyer, JLJacobson, KA Synthesis, biological activity, and molecular modeling of ribose-modified deoxyadenosine bisphosphate analogues as P2Y(1) receptor ligands. J Med Chem43:829-42 (2000) P2Y purinoceptor 1
Name:P2Y purinoceptor 1
Type:n/a
Mol. Mass.:41199.64
Organism:Meleagris gallopavo
Description:n/a
Residue:362
BDBM50085827
NameBDBM50085827
Synonyms:CHEMBL169580 | Phosphoric acid mono-[5-(6-methylamino-purin-9-yl)-3-phosphonooxy-tetrahydro-furan-2-yl] ester
TypeSmall organic molecule
Emp. Form.C12H22N6O14P4
Mol. Mass.598.2299
SMILESNc1ncnc2n(cnc12)C1CN(CCP(O)(O)=O)CC(COP(O)(=O)OP(O)(=O)OP(O)(O)=O)O1