Reaction Details
TargetP2Y purinoceptor 1
LigandBDBM50085829
Substrate/Competitorn/a
Meas. Tech.ChEMBL_147720 (CHEMBL759190)
EC50 6510±n/a nM
Citation Nandanan, EJang, SYMoro, SKim, HOSiddiqui, MARuss, PMarquez, VEBusson, RHerdewijn, PHarden, TKBoyer, JLJacobson, KA Synthesis, biological activity, and molecular modeling of ribose-modified deoxyadenosine bisphosphate analogues as P2Y(1) receptor ligands. J Med Chem43:829-42 (2000) P2Y purinoceptor 1
Name:P2Y purinoceptor 1
Type:n/a
Mol. Mass.:41199.64
Organism:Meleagris gallopavo
Description:n/a
Residue:362
BDBM50085829
NameBDBM50085829
Synonyms:CHEMBL355406 | Phosphoric acid mono-[4-(2-amino-6-methylamino-purin-9-yl)-2-phosphonooxy-cyclopentyl] ester
TypeSmall organic molecule
Emp. Form.C12H20N6O8P2
Mol. Mass.438.2701
SMILESCNc1nc(N)nc2n(cnc12)[C@@H]1C[C@H](COP(O)(O)=O)[C@@H](C1)OP(O)(O)=O