Reaction Details
TargetMelatonin receptor type 1A
LigandBDBM9019
Substrate/Competitorn/a
Meas. Tech.ChEMBL_105101 (CHEMBL715945)
Ki 0.660±n/a nM
Citation Faust, RGarratt, PJJones, RYeh, LKTsotinis, APanoussopoulou, MCalogeropoulou, TTeh, MTSugden, D Mapping the melatonin receptor. 6. Melatonin agonists and antagonists derived from 6H-isoindolo[2,1-a]indoles, 5,6-dihydroindolo[2,1-a]isoquinolines, and 6,7-dihydro-5H-benzo[c]azepino[2,1-a]indoles. J Med Chem43:1050-61 (2000) Melatonin receptor type 1A
Name:Melatonin receptor type 1A
Type:Enzyme
Mol. Mass.:39392.94
Organism:Homo sapiens (Human)
Description:P48039
Residue:350
BDBM9019
NameBDBM9019
Synonyms:CHEMBL45 N-[2-(5-methoxy-1H-indol-3-yl)ethyl]acetamide
TypeSmall organic molecule
Emp. Form.C13H16N2O2
Mol. Mass.232.2783
SMILESCOc1ccc2[nH]cc(CCNC(C)=O)c2c1