Reaction Details
TargetMelatonin receptor type 1A
LigandBDBM50086013
Substrate/Competitorn/a
Meas. Tech.ChEMBL_105101 (CHEMBL715945)
Ki 4.470±n/a nM
Citation Faust, RGarratt, PJJones, RYeh, LKTsotinis, APanoussopoulou, MCalogeropoulou, TTeh, MTSugden, D Mapping the melatonin receptor. 6. Melatonin agonists and antagonists derived from 6H-isoindolo[2,1-a]indoles, 5,6-dihydroindolo[2,1-a]isoquinolines, and 6,7-dihydro-5H-benzo[c]azepino[2,1-a]indoles. J Med Chem43:1050-61 (2000) Melatonin receptor type 1A
Name:Melatonin receptor type 1A
Type:Enzyme
Mol. Mass.:39392.94
Organism:Homo sapiens (Human)
Description:P48039
Residue:350
BDBM50086013
NameBDBM50086013
Synonyms:CHEMBL10009 | N-[2-(2-Methoxy-6H-isoindolo[2,1-a]indol-11-yl)-ethyl]-butyramide
TypeSmall organic molecule
Emp. Form.C22H24N2O2
Mol. Mass.348.4382
SMILESCCCC(=O)NCCc1c2-c3ccccc3Cn2c2ccc(OC)cc12