Reaction Details
TargetMelatonin receptor type 1B
LigandBDBM50086010
Substrate/Competitorn/a
Meas. Tech.ChEMBL_105265 (CHEMBL872558)
Ki 12±n/a nM
Citation Faust, RGarratt, PJJones, RYeh, LKTsotinis, APanoussopoulou, MCalogeropoulou, TTeh, MTSugden, D Mapping the melatonin receptor. 6. Melatonin agonists and antagonists derived from 6H-isoindolo[2,1-a]indoles, 5,6-dihydroindolo[2,1-a]isoquinolines, and 6,7-dihydro-5H-benzo[c]azepino[2,1-a]indoles. J Med Chem43:1050-61 (2000) Melatonin receptor type 1B
Name:Melatonin receptor type 1B
Type:Enzyme
Mol. Mass.:40203.54
Organism:Homo sapiens (Human)
Description:P49286
Residue:362
BDBM50086010
NameBDBM50086010
Synonyms:CHEMBL10328 | N-[2-(6H-Isoindolo[2,1-a]indol-11-yl)-ethyl]-butyramide
TypeSmall organic molecule
Emp. Form.C21H22N2O
Mol. Mass.318.4122
SMILESCCCC(=O)NCCc1c2-c3ccccc3Cn2c2ccccc12